خالص‌سازی
preferred label: purification @en
type: Concept
narrower: خالص‌سازی نهایی

خالص‌سازی نهایی
scope note: حذف دقیق و نهایی ترکیبات نامطلوب و آلاینده به‌نحوی‌که کمترین مقدار ممکن از آنها در مادۀ خالص‌شده باقی بماند.
broader: خالص‌سازی
preferred label: fine purification @en
type: Concept