واپاشى پرتوزا
preferred label: radioactive decay @en
type: Concept
narrower: واپاشی بتازا

واپاشی بتازا
scope note: تبدیل پرتوزایی یک نوکلئید که در آن عدد اتمی به اندازۀ یک واحد کاهش یا افزایش یابد، اما عدد جِرمی تغییر نکند.
broader: واپاشى پرتوزا
preferred label: β-decay @en
type: Concept