دیوار (بخش سازه‌ای)
preferred label: wall (structural partition) @en
type: Concept
narrower: دیوار توخالی

دیوار توخالی
scope note: دیوار دوجداره‌ای که فضای داخل آن خالی باشد.
broader: دیوار (بخش سازه‌ای)
preferred label: cavity wall @en
type: Concept