دیوار (بخش سازه‌ای)
preferred label: wall (structural partition) @en
type: Concept
narrower: دیوار بالی

دیوار بالی
scope note: دیواری فرعی که از یک سر به دیوار تکیه‌گاه متصل می‌شود.
broader: دیوار (بخش سازه‌ای)
preferred label: wing wall @en
type: Concept