ساختمان
preferred label: building @en
type: Concept
narrower: ساختمان قابی

ساختمان قابی
scope note: ساختمانی که بار آن با قاب به زمین منتقل شود.
broader: ساختمان
preferred label: framed building @en
type: Concept