برش‌نگاری
preferred label: tomography @en
type: Concept
narrower: برش‌نگاری لرزه‌ای

برش‌نگاری لرزه‌ای
scope note: روشی برای یافتن توزیع سرعت و بازتابندگی با مشاهده‌های بسیار و به‌کارگیری چیدمان‌های مختلف چشمه و گیرنده
broader: برش‌نگاری
preferred label: seismic tomography @en
type: Concept