تصفیه پسماند
preferred label: waste treatment @en
type: Concept
narrower: تصفیه درجا

تصفیه درجا
scope note: فرایند تصفیۀ بسترۀ آلوده، اعم از خاک یا لجن یا آب زیرزمینی در محل
broader: تصفیه پسماند
preferred label: in-situ treatment @en
type: Concept