تصفیه آخر خط
scope note: روشی برای تصفیه که در آن کل فاضلاب مناطق مختلف یک‌جا جمع‌آوری و به تصفیه‌خانه منتقل می‌شود.
broader: تصفیه فاضلاب
preferred label: end-of-line treatment @en
type: Concept

تصفیه فاضلاب
preferred label: wastewater treatment @en
type: Concept
narrower: تصفیه آخر خط