یخچال آبی
type: Concept
preferred label: Blue Glacier @en
related: رشته‌کوه المپیک
related: واشنگتن
scope note: کوه اولیمپوس، پارک ملی المپیک در شمال غرب واشنگتن و همچنین در جاهای دیگر

رشته‌کوه المپیک
type: Concept
preferred label: Olympic Mountains @en
related: یخچال آبی

واشنگتن
type: Concept
preferred label: Washington @en
related: یخچال آبی