پاریکوتین
type: Concept
broader: میشواکان مکزیک
preferred label: Paricutin @en
related: آتشفشان
scope note: آتشفشانی در محل روستای قدیمی پاریکوتین در جنوب غرب مکزیک

میشواکان مکزیک
type: Concept
narrower: پاریکوتین
preferred label: Michoacan Mexico @en

آتشفشان
type: Concept
preferred label: volcano @en
related: پاریکوتین