اتیلن
type: Concept
preferred label: ethylene @en
related: تری‌کلرواتیلن

تری‌کلرواتیلن
type: Concept
broader: هیدروکربن کلروردار
preferred label: trichloroethylene @en
related: اتیلن
scope note: مایعی بی رنگ با بوی شبیه به کلروفرم است با دمای جوش 87 درجه که آتشگیر نیست ولی برای دستگاه تنفسی سمی است

هیدروکربن کلروردار
type: Concept
narrower: تری‌کلرواتیلن
preferred label: chlorinated hydrocarbon @en