معدن‌کاری روباز
type: Concept
broader: معدن‌کاری
preferred label: quarrying @en
scope note: استخراج سنگ ساختمانی یا دیگر مواد ارزشمند غیرفلزی از یک معدن سطحی روباز

معدن‌کاری
type: Concept
narrower: معدن‌کاری روباز
preferred label: mining @en