هوازدگی تفریقی
type: Concept
broader: هوازدگی
preferred label: differential weathering @en
related: تفریق
scope note: فرایندی که در طی آن توده‏سنگ‌های مختلف یا بخش‌های متفاوت یک سنگ با آهنگ‌های متفاوت هوازده شود

هوازدگی
type: Concept
narrower: هوازدگی تفریقی
preferred label: weathering @en

تفریق
type: Concept
preferred label: differentiation @en
related: هوازدگی تفریقی