گچ ساراتوگا
type: Concept
broader: کرتاسه فوقانی
preferred label: Saratoga chalk @en
related: آرکانزاس
scope note: شامل یک بخش گچ زیرین و یک واحد آرژیلی ماسه‌ای بالایی. جنوب غرب آرکانزاس

کرتاسه فوقانی
type: Concept
narrower: گچ ساراتوگا
preferred label: Upper Cretaceous @en

آرکانزاس
type: Concept
preferred label: Arkansas @en
related: گچ ساراتوگا