گروه بلیرمور
type: Concept
broader: کرتاسه
preferred label: Blairmore Group @en
related: آلبرتا
scope note: شامل سازند گلداستون، سازند بیورماینز و سازند میل کریک در جنوب آلبرتا.

کرتاسه
type: Concept
narrower: گروه بلیرمور
preferred label: Cretaceous @en

آلبرتا
type: Concept
preferred label: Alberta @en
related: گروه بلیرمور