مخزن تاقدیسی
type: Concept
preferred label: anticlinal reservoir @en
related: تاقدیسی
related: تاقدیس
scope note: نوعی مخزن نفت که در یک ساختار تاقدیسی قرار دارد

تاقدیسی
type: Concept
preferred label: anticlinal @en
related: مخزن تاقدیسی

تاقدیس
type: Concept
preferred label: anticline @en
related: مخزن تاقدیسی