ماگمای والد
type: Concept
broader: ماگما
preferred label: parental magma @en
scope note: ماگمایی که سنگ آذرین خاصی از آن به وجود آمده یا ماگمای دیگری از آن مشتق شده باشد

ماگما
type: Concept
narrower: ماگمای والد
preferred label: magma @en