جلبک‌ها
type: Concept
preferred label: Algae @en
related: گونه درون سنگی

گونه درون سنگی
type: Concept
alternative label: اندولیت
preferred label: endolithic taxon @en
related: جلبک‌ها
scope note: موجوداتی که در شکافای ریز مرجانها، صدفها و ریفهای سنگی زندگی می کنند.