گونه جدید
type: Concept
alternative label: نسل جديد
preferred label: neotype @en
related: فسیل
related: نمونه تیپ
scope note: نمونه انتخاب شده به جای نمونه شاخص، زمانیکه تمامی مواد اولیه از دست رفته یا نابود شده است.

فسیل
type: Concept
preferred label: fossil @en
related: گونه جدید

نمونه تیپ
type: Concept
preferred label: type specimen @en
related: گونه جدید