گوگرد دی‌اکسید
type: Concept
preferred label: sulfur dioxide @en
related: جو
related: آلودگی
scope note: گاز سنگینی که به سرعت در اثر فشار به مایع تبدیل شده و در ساخت اسید سولفوریک و برای رنگ کردن پارچه و غیره بکار می‌رود.

جو
type: Concept
preferred label: atmosphere @en
related: گوگرد دی‌اکسید

آلودگی
type: Concept
preferred label: pollution @en
related: گوگرد دی‌اکسید