گوشته غنی‌شده
type: Concept
broader: گوشته
preferred label: enriched mantle @en
related: گوشته
scope note: بخشی از گوشتۀ زمین که غلظت عناصر ناسازگار در آن افزایش یافته و درنتیجه ظرفیت تولید ماگما از راه ذوب بخشی تشدید شده است

گوشته
type: Concept
narrower: گوشته غنی‌شده
preferred label: mantle @en
related: گوشته غنی‌شده