گنبد درون‌زاد
type: Concept
broader: گنبد آتشفشانی
preferred label: endogenous dome @en
scope note: گنبدی آتشفشانی که در آغاز در نتیجۀ گسترش درونی آتشفشان پدید آمده است و ویژگی آن آرایش هم‌مرکز لایه‌های جریانی است

گنبد آتشفشانی
type: Concept
narrower: گنبد درون‌زاد
preferred label: volcanic dome @en