گسیل آتشفشانی
type: Concept
preferred label: volcanic emission @en
related: آتشفشان
related: آتشفشانی
scope note: مواد خروجی عمدتاً گازی که براثر فعالیت آتشفشان از آن خارج می‌شوند

آتشفشانی
type: Concept
preferred label: volcanic @en
related: گسیل آتشفشانی

آتشفشان
type: Concept
preferred label: volcano @en
related: گسیل آتشفشانی