گاه چینه‌شناسی
type: Concept
preferred label: chronostratigraphy @en
related: چینه‌شناسی
scope note: مجموعه طبقاتی که هر کدام معرف دورانهای تاریخی معینی می‌باشد.

چینه‌شناسی
type: Concept
preferred label: stratigraphy @en
related: گاه چینه‌شناسی