کوه راند
type: Concept
preferred label: Round Mountain @en
related: ناحیه نی نوادا
scope note: محل نهشته‌های طلا در ناحیه نیه، جنوب مرکز نوادا

ناحیه نی نوادا
type: Concept
preferred label: Nye County Nevada @en
related: کوه راند