استرونتیانیت
type: Concept
broader: کربنات‌ها
preferred label: strontianite @en
scope note: کربنات استرونسیم، SrCo3، در سیستم راست‌لوزی متبلور می‌شود، سختی 5/3 چگالی 7/3، دارای بلورهای سوزنی که به صورت گروه‌های توده‌ای باسیلی دیده می‌شود. جلای شیشه‌ای، بی‌رنگ، سفید، صورتی، متمایل به سبز در رگه‌های هیدروترمال بوجود می‌آید.

کربنات‌ها
type: Concept
narrower: استرونتیانیت
preferred label: carbonates @en