کان‌سنگ رسوبی
type: Concept
broader: کان‌سنگ
preferred label: sedimentary ore @en

کان‌سنگ
type: Concept
narrower: کان‌سنگ رسوبی
preferred label: ore @en
scope note: مادۀ طبیعی که از آن یک یا چند کانی دارای ارزش اقتصادی استخراج شود؛ این اصطلاح بیشتر در مورد مواد فلزدار و همراه با نام آن مواد به کار می‏رود