تی مینز اونتاریو
type: Concept
broader: اونتاریو
preferred label: Timmins Ontario @en
scope note: شهر معدنی در 135 مایلی شمال سادبری مابین لیک هورن و خلیج جیمز

اونتاریو
type: Concept
narrower: تی مینز اونتاریو
preferred label: Ontario @en