دهانه برنت
type: Concept
broader: ناحیه نیپیسینگ اونتاریو
preferred label: Brent Crater @en
related: عوارض برخوردی
scope note: دهانه شهاب سنگی در برنت در پارک ایالتی آلگونکوتین شرق خلیج جورجین کانادا

ناحیه نیپیسینگ اونتاریو
type: Concept
narrower: دهانه برنت
preferred label: Nipissing District Ontario @en

عوارض برخوردی
type: Concept
preferred label: impact features @en
related: دهانه برنت