دره رود رد دیر
type: Concept
preferred label: Red Deer River Valley @en
related: رودخانه رد دیر

رودخانه رد دیر
type: Concept
broader: آلبرتا
preferred label: Red Deer River @en
related: دره رود رد دیر
scope note: از پارک ملی بَنف سرچشمه گرفته و به سوی رود ساسکاچوان جنوبی ادامه دارد در نزدیکی مرز ساسکاچوان

آلبرتا
type: Concept
narrower: رودخانه رد دیر
preferred label: Alberta @en