جزیره کورنوالیس
type: Concept
broader: سرزمینهای شمال غربی
preferred label: Cornwallis Island @en
related: سازند خلیج رید
scope note: یکی از جزایر پاری در مرکز ناحیه فرانکلین، شمال مرکز سرزمینهای شمال غربی.

سرزمینهای شمال غربی
type: Concept
narrower: جزیره کورنوالیس
preferred label: Northwest Territories @en

سازند خلیج رید
type: Concept
preferred label: Read Bay Formation @en
related: جزیره کورنوالیس