یلونایف سرزمینهای شمال غربی
type: Concept
broader: سرزمینهای شمال غربی
preferred label: Yellowknife Northwest Territories @en
scope note: شهری در لبه شمال غربی دریاچه گریت اسلاو و دردهانه رود یلونایف در جنوب ناحیه مکنزی

سرزمینهای شمال غربی
type: Concept
narrower: یلونایف سرزمینهای شمال غربی
preferred label: Northwest Territories @en