رشته‌کوه شاکلتون
type: Concept
broader: قاره جنوبگان
preferred label: Shackleton Range @en
scope note: جنوب شرق سپر یخی فیشنر که در دریای ودل در کناره اقیانوس اطلس واقع شده است

قاره جنوبگان
type: Concept
narrower: رشته‌کوه شاکلتون
preferred label: Antarctica @en