سکوی جنوبگان
type: Concept
broader: قاره جنوبگان
preferred label: Antarctic Platform @en
scope note: ناحیه مرکزی که تشکیل یک فلات مرتفع را میدهد.

قاره جنوبگان
type: Concept
narrower: سکوی جنوبگان
preferred label: Antarctica @en