پرازئودیمیم
type: Concept
broader: خاک کمیاب
preferred label: praseodymium @en
scope note: عدد اتمی 59، وزن اتمی 91/140، دمای ذوب 931 درجه (س)، دمای جوش 2/32 درجه(س)،از لانتانیدهاست

خاک کمیاب
type: Concept
narrower: پرازئودیمیم
preferred label: rare earth @en