دوره‌سنگ
type: Concept
broader: واحد گاه‌چینه‌نگاشتی
preferred label: system(chronostratigraphic unit) @en
scope note: واحد گاه‌چینه‌نگاشتی کوچک‌تر از دوران‌سنگ و بزرگ‌تر از دورسنگ

واحد گاه‌چینه‌نگاشتی
type: Concept
narrower: دوره‌سنگ
preferred label: chronostratigraphic unit @en