فرسایش جانبی
type: Concept
broader: فرسایش
preferred label: lateral erosion @en
scope note: فرسایشی که در آن دیوارۀ بستر رودخانه با حرکت آب شسته و برده می‌شود

فرسایش
type: Concept
narrower: فرسایش جانبی
preferred label: erosion @en