مواد فرّار
type: Concept
preferred label: volatile matter @en
related: فرّارزدایی

فرّارزدایی
type: Concept
preferred label: devolatization @en
related: مواد فرّار
related: دگرگونی
scope note: فرایندی دگرگونی که به خارج شدن سازاهای فرّار و افزایش متناسب سازاهای غیرِفرّار منجر می‌شود

دگرگونی
type: Concept
preferred label: metamorphism @en
related: فرّارزدایی