فرارانش
type: Concept
preferred label: obduction @en
related: فرارانده

فرارانده
type: Concept
preferred label: obducted @en
related: صفحه فرارو
related: فرارانش
scope note: حالت صفحۀ اقیانوسی که بر لبۀ صفحۀ قاره‏ای رانده شده است

صفحه فرارو
type: Concept
preferred label: obducting plate @en
related: فرارانده