غبار آتشفشانی
type: Concept
preferred label: volcanic dust @en
related: آتشفشان
related: آتشفشانی
scope note: غبار یا خاکستر یا دیگر مواد بسیار ریزی که معمولاً پس از فوران‌های آتشفشانی در جوّ معلق می‌شوند

آتشفشانی
type: Concept
preferred label: volcanic @en
related: غبار آتشفشانی

آتشفشان
type: Concept
preferred label: volcano @en
related: غبار آتشفشانی