غول‌دهانه انفجاری
type: Concept
broader: غول‌دهانه
preferred label: explosion caldera @en
scope note: غول‌دهانه‌ای که در نتیجۀ از بین رفتن بخش بالایی مخروط آتشفشانی براثر انفجار به وجود می‌آید

غول‌دهانه
type: Concept
narrower: غول‌دهانه انفجاری
preferred label: caldera @en