مخروط آتشفشانی
type: Concept
broader: عوارض آتشفشانی
preferred label: volcanic cone @en
scope note: ساختاری مخروطی که براثر خروج گدازه یا مواد آذرآواری از یک دهانه به وجود می‌آید

عوارض آتشفشانی
type: Concept
narrower: مخروط آتشفشانی
preferred label: volcanic features @en