نهشته خشکی‏زاد
type: Concept
broader: نهشته
preferred label: terrigenous deposit @en
scope note: رسوب دریایی کم‏عمقی که از فرسایش مواد سطح خشکی و انتقال آنها به دریا تشکیل شده است

نهشته
type: Concept
narrower: نهشته خشکی‏زاد
preferred label: deposit(sedimentology) @en