ایکتیوساروس
type: Concept
broader: ایکتیوساریا
preferred label: Ichthyosaurus @en

ایکتیوساریا
type: Concept
broader: دیاپسیدا
narrower: ایکتیوساروس
preferred label: Ichthyosauria @en
scope note: راسته‌ای از خزندگان فسیلی که در دوران میانه می‌زیسته‌اند و در دریا به سر می‌برده‌اند. از نظر شکل ظاهری و طرز شنا کردن به ماهی شباهت داشته‌اند. زنده‌زا و همیشه آبزی بوده‌اند.

دیاپسیدا
type: Concept
narrower: ایکتیوساریا
preferred label: Diapsida @en