فرارانش
type: Concept
preferred label: obduction @en
related: صفحه فرارو

فرارانده
type: Concept
preferred label: obducted @en
related: صفحه فرارو

صفحه فرارو
type: Concept
preferred label: obducting plate @en
related: فرارانده
related: فرارانش
scope note: صفحه اقیانوسی که بر لبه صفحۀ قاره‏ای رانده می‏شود