صفحه رنگ خاکه
type: Concept
preferred label: streak plate @en
related: رنگ خاکه
scope note: قطعه‏ای چینی بدون لعاب که در کانی‏شناسی از آن برای گرفتن رنگ خاکۀ کانی استفاده می‏شود

رنگ خاکه
type: Concept
preferred label: streak @en
related: صفحه رنگ خاکه