درزه برشی
type: Concept
broader: درزه
preferred label: shear joint @en
scope note: درزه‏ای که براثر اعمال نیروی برشی به‌ وجود آمده است

درزه
type: Concept
narrower: درزه برشی
preferred label: joint @en