درزه متقاطع
type: Concept
broader: درزه
preferred label: transverse joint @en
scope note: درزه‏ای که بر خطواره‏های اصلی سنگ عمود است

درزه
type: Concept
narrower: درزه متقاطع
preferred label: joint @en