درزه نازمین‏ساختی
type: Concept
broader: درزه
preferred label: nontectonic joint @en
scope note: درزه‏ای که براثر فشارش عواملی غیر از عوامل زمین‏ساختی به وجود می‌آید

درزه
type: Concept
narrower: درزه نازمین‏ساختی
preferred label: joint @en