درزه‏های بی‌سامان
type: Concept
broader: درزه
preferred label: nonsystematic joints @en
scope note: درزه‏هایی که متعلق به یک دسته‏ درزۀ واحد نیستند

درزه
type: Concept
narrower: درزه‏های بی‌سامان
preferred label: joint @en